Sewer Network Ontology (SewerNet)
type: Ontology
imports: DOLCE-Lite.owl
creator: Batoul Haydar, Nanée Chahinian and Maria Keet
rights: This work is licensed under Creative Commons Attribution 4.0 International
comment: SewerNet describes the structure and functioning of wastewater and stormwater networks and their elements. @en
comment: SewerNet décrit la structure et le fonctionnement des réseaux d'eaux usées et d'eaux pluviales et de leurs éléments.
comment: This ontology was developed as part of CROQUIS and STARWARS project funded by ANR and EU.

assignedTo
type: ObjectProperty
domain: physical-object
range: non-physical-object
comment: Assigns network and network elements with roles @en

hasBearer
type: ObjectProperty
domain: non-physical-object
range: physical-object
comment: Associates conduit categories with individual conduits. @en

weakConnectionDownstream
type: ObjectProperty
sub property of: weak-connection
domain: physical-object
range: physical-object
comment: Connects nodes with downstream conduits @en

weakConnectionUpstream
type: ObjectProperty
sub property of: weak-connection
domain: physical-object
range: physical-object
comment: Connects nodes with upstream conduits @en

has beginning
type: ObjectProperty
sub property of: has time
domain: Temporal entity
range: Time instant
comment: Beginning of a temporal entity @en
comment: Comienzo de una entidad temporal. @es
label: tiene principio @es
definition: Beginning of a temporal entity. @en

has duration
type: ObjectProperty
sub property of: has temporal duration
range: duración de tiempo
comment: Duración de una entidad temporal, expresada como un valor escalado o un valor nominal. @es
comment: Duration of a temporal entity, expressed as a scaled value or nominal value @en
label: tiene duración @es
definition: Duración de una entidad temporal, evento o actividad, o cosa, expresada como un valor escalado. @es
definition: Duration of a temporal entity, event or activity, or thing, expressed as a scaled value @en

has duration description
type: ObjectProperty
sub property of: has temporal duration
range: Generalized duration description
comment: Duración de una entidad temporal, expresada utilizando una descripción estructurada. @es
comment: Duration of a temporal entity, expressed using a structured description @en
label: tiene descripción de duración @es

has end
type: ObjectProperty
sub property of: has time
domain: Temporal entity
range: Time instant
comment: End of a temporal entity. @en
comment: Final de una entidad temporal. @es
label: tiene fin @es

has temporal duration
type: ObjectProperty
domain: Temporal entity
range: Temporal duration
comment: Duración de una entidad temporal. @es
comment: Duration of a temporal entity. @en
label: tiene duración temporal @es

has time
type: ObjectProperty
range: Temporal entity
comment: Proporciona soporte a la asociación de una entidad temporal (instante o intervalo) a cualquier cosa. @es
comment: Supports the association of a temporal entity (instant or interval) to any thing @en
label: tiene tiempo @es
editorial note: Característica arriesgada -añadida en la revisión del 2017 que no ha sido todavía utilizada de forma amplia. @es
editorial note: Feature at risk - added in 2017 revision, and not yet widely used. @en

Ventouse
type: Class
subclass of: Appareillage
comment: Ventouse d'assainissement
see also: Géostandard Réseaux d’adduction d’eau potable et d’assainissement (RAEPA) v1.2 https://www.geoinformations.developpement-durable.gouv.fr/geostandard-reseaux-d-adduction-d-eau-potable-et-d-a3674.html

Appareillage
type: Class
subclass of: Nœud
comment: Nœud où est positionné un appareillage et son enveloppe (vanne et bouche à clé, percement pour branchement individuel, etc.) abrité dans un ouvrage ou non (cas de piquage)
comment: Subclasses include the msot common apparatus. @en
label: Equipment, Fittings @en
see also: Géostandard Réseaux d’adduction d’eau potable et d’assainissement (RAEPA) v1.2 https://www.geoinformations.developpement-durable.gouv.fr/geostandard-reseaux-d-adduction-d-eau-potable-et-d-a3674.html

AttributeAuthor
type: Class
subclass of: SocialObject
subclass of: Restriction
  on property: participant-in
  some values from: Geolocalization
comment: Auteur de la saisie des données attributaires (lorsque différent de l'auteur de la géolocalisation)
see also: Géostandard Réseaux d’adduction d’eau potable et d’assainissement (RAEPA) v1.2 https://www.geoinformations.developpement-durable.gouv.fr/geostandard-reseaux-d-adduction-d-eau-potable-et-d-a3674.html

Ciment
type: Class
subclass of: Matériau

Canal
type: Class
subclass of: Canalisation
comment: An open conduit that directs flow @en

Collecte
type: Class
subclass of: Fonction Canalisation Assainissement
disjoint with: Transport
comment: Canalisation de collecte
comment: mainly used for collection of sewage water @en
see also: Géostandard Réseaux d’adduction d’eau potable et d’assainissement (RAEPA) v1.2 https://www.geoinformations.developpement-durable.gouv.fr/geostandard-reseaux-d-adduction-d-eau-potable-et-d-a3674.html
see also: Infrastructure for Spatial Information in Europe (INSPIRE) @en

Unitaire
type: Class
subclass of: Catégorie Canalisation Assainissement
comment: Canalisation véhiculant des eaux usées et pluviales en fonctionnement normal
see also: Géostandard Réseaux d’adduction d’eau potable et d’assainissement (RAEPA) v1.2 https://www.geoinformations.developpement-durable.gouv.fr/geostandard-reseaux-d-adduction-d-eau-potable-et-d-a3674.html

Unitaire
type: Class
subclass of: Type Réseau Assainissement
comment: Réseau de collecte des eaux usées et des eaux pluviales
see also: Géostandard Réseaux d’adduction d’eau potable et d’assainissement (RAEPA) v1.2 https://www.geoinformations.developpement-durable.gouv.fr/geostandard-reseaux-d-adduction-d-eau-potable-et-d-a3674.html

Eaux usées combinée
type: Class
subclass of: Type d'eaux usées
comment: A combined wastewater sewer is a type of sewer system that collects sanitary sewage and stormwater runoff in a single pipe system. @en
see also: Infrastructure for Spatial Information in Europe (INSPIRE) @en

Béton
type: Class
subclass of: Matériau
comment: It includes among others: reinforced concrete, composite concrete, prestressed reinforced concrete @en

Canalisation
type: Class
subclass of: Élément de réseau
subclass of: Restriction
  on property: generic-dependent
  some values from: Fonction Canalisation Assainissement
subclass of: Restriction
  on property: has-quality
  some values from: Mode Circulation
subclass of: Restriction
  on property: has-quality
  some values from: Diametre Nominal
subclass of: Restriction
  on property: has-quality
  some values from: Dimension
subclass of: Restriction
  on property: has-quality
  some values from: Sens Ecoulement
subclass of: Restriction
  on property: has-quality
  some values from: Longueur
subclass of: Restriction
  on property: has-quality
  some values from: Forme
subclass of: Restriction
  on property: has-quality
  some values from: Pente
subclass of: Restriction
  on property: specific-constant-constituent
  some values from: Matériau
subclass of: Restriction
  on property: weak-connection
  some values from: Nœud
comment: Ensemble de tuyaux joints par leurs extrémités, de caractéristiques physiques (diamètre, matériau, etc.) identiques, représenté spatialement par une ligne.
label: Tronçon de conduite
see also: Géostandard Réseaux d’adduction d’eau potable et d’assainissement (RAEPA) v1.2 https://www.geoinformations.developpement-durable.gouv.fr/geostandard-reseaux-d-adduction-d-eau-potable-et-d-a3674.html

Catégorie Canalisation Assainissement
type: Class
subclass of: non-physical-object
subclass of: Restriction
  on property: hasBearer
  some values from: Canalisation
subclass of: Restriction
  on property: generically-dependent-on
  some values from: Type d'eaux usées
comment: Nature des eaux véhiculées par une canalisation d'assainissement collectif
see also: Géostandard Réseaux d’adduction d’eau potable et d’assainissement (RAEPA) v1.2 https://www.geoinformations.developpement-durable.gouv.fr/geostandard-reseaux-d-adduction-d-eau-potable-et-d-a3674.html

Mode Circulation
type: Class
subclass of: quality
subclass of: Restriction
  on property: inherent-in
  some values from: Canalisation
comment: Modalité de circulation de l'eau dans une canalisation
see also: Géostandard Réseaux d’adduction d’eau potable et d’assainissement (RAEPA) v1.2 https://www.geoinformations.developpement-durable.gouv.fr/geostandard-reseaux-d-adduction-d-eau-potable-et-d-a3674.html

Fonction Canalisation Assainissement
type: Class
subclass of: non-physical-object
subclass of: Restriction
  on property: generically-dependent-on
  some values from: Canalisation
comment: Fonction dans le réseau d'une canalisation d'assainissement collectif
see also: Géostandard Réseaux d’adduction d’eau potable et d’assainissement (RAEPA) v1.2 https://www.geoinformations.developpement-durable.gouv.fr/geostandard-reseaux-d-adduction-d-eau-potable-et-d-a3674.html

Point de conduite
type: Class
subclass of: Partie de l'élément de réseau
subclass of: Restriction
  on property: weak-connection
  all values from: Nœud
comment: A point on a conduit @en

Point de branchement
type: Class
subclass of: Appareillage
comment: Piquage de branchement individuel
see also: Géostandard Réseaux d’adduction d’eau potable et d’assainissement (RAEPA) v1.2 https://www.geoinformations.developpement-durable.gouv.fr/geostandard-reseaux-d-adduction-d-eau-potable-et-d-a3674.html

Coordinate
type: Class
subclass of: space-region
subclass of: Restriction
  on property: q-location-of
  some values from: Géométrie
comment: Coordonnée

Fissure
type: Class
subclass of: Défaillance
comment: Canalisation fissurée
see also: Géostandard Réseaux d’adduction d’eau potable et d’assainissement (RAEPA) v1.2 https://www.geoinformations.developpement-durable.gouv.fr/geostandard-reseaux-d-adduction-d-eau-potable-et-d-a3674.html

Arrêt définitif de service (abandon)
type: Class
subclass of: Etat de service du patrimoine
comment: The facility is no longer used and is being or has been decommissioned. @en
see also: Infrastructure for Spatial Information in Europe (INSPIRE) @en

Joint
type: Class
subclass of: Défaillance
comment: Joint défectueux
see also: Géostandard Réseaux d’adduction d’eau potable et d’assainissement (RAEPA) v1.2 https://www.geoinformations.developpement-durable.gouv.fr/geostandard-reseaux-d-adduction-d-eau-potable-et-d-a3674.html

Diametre Nominal
type: Class
subclass of: physical-quality
subclass of: Restriction
  on property: inherent-in
  some values from: Canalisation
subclass of: Restriction
  on property: inherent-in
  some values from: Tampon de regard

Dimension
type: Class
subclass of: physical-quality
subclass of: Restriction
  on property: inherent-in
  some values from: Canalisation

Rejet
type: Class
subclass of: Ouvrage
comment: Rejet (exutoire) dans le milieu naturel d'eaux usées ou pluviales
see also: Géostandard Réseaux d’adduction d’eau potable et d’assainissement (RAEPA) v1.2 https://www.geoinformations.developpement-durable.gouv.fr/geostandard-reseaux-d-adduction-d-eau-potable-et-d-a3674.html

Déboîtement
type: Class
subclass of: Défaillance
comment: Déboîtement de tuyau(x) de la canalisation
see also: Géostandard Réseaux d’adduction d’eau potable et d’assainissement (RAEPA) v1.2 https://www.geoinformations.developpement-durable.gouv.fr/geostandard-reseaux-d-adduction-d-eau-potable-et-d-a3674.html

Arrêt de service
type: Class
subclass of: Etat de service du patrimoine
comment: The facility is no longer used, but is not being or has not been decommissioned.
see also: Infrastructure for Spatial Information in Europe (INSPIRE) @en

Extrémité du conduit aval
type: Class
subclass of: Point de conduite
comment: Final point of a conduit (terminal point) @en

Altitude
type: Class
subclass of: spatial-location q
subclass of: Restriction
  on property: inherent-in
  some values from: Partie de l'élément de réseau
subclass of: Restriction
  on property: inherent-in
  some values from: Nœud

Sens Ecoulement
type: Class
subclass of: physical-quality
subclass of: Restriction
  on property: inherent-in
  some values from: Canalisation

Débitmètre
type: Class
subclass of: Appareillage
comment: Appareil de mesure des débits transités
see also: Géostandard Réseaux d’adduction d’eau potable et d’assainissement (RAEPA) v1.2 https://www.geoinformations.developpement-durable.gouv.fr/geostandard-reseaux-d-adduction-d-eau-potable-et-d-a3674.html

Forcé
type: Class
subclass of: Mode Circulation
comment: L'eau circule sous pression dans la canalisation grâce à un système de pompage
see also: Géostandard Réseaux d’adduction d’eau potable et d’assainissement (RAEPA) v1.2 https://www.geoinformations.developpement-durable.gouv.fr/geostandard-reseaux-d-adduction-d-eau-potable-et-d-a3674.html

En service
type: Class
subclass of: Etat de service du patrimoine
comment: The facility is functional. @en
see also: Infrastructure for Spatial Information in Europe (INSPIRE) @en

Geolocalization
type: Class
subclass of: achievement
subclass of: Restriction
  on property: has-quality
  some values from: Qualité Géolocalisation
subclass of: Restriction
  on property: participant
  some values from: AttributeAuthor
subclass of: Restriction
  on property: participant
  some values from: Élément de réseau
subclass of: Restriction
  on property: participant
  some values from: Partie de l'élément de réseau
subclass of: Restriction
  on property: has time
  some values from: Temporal entity
comment: The act of locating objects.

Qualité Géolocalisation
type: Class
subclass of: temporal-quality
subclass of: Restriction
  on property: inherent-in
  some values from: Geolocalization
comment: Classe de précision au sens de l'arrêté interministériel du 15 février 2012 modifié Classe A : Classe de précision inférieure 40 cm Classe B : Classe de précision supérieure à 40 cm et inférieure à 1,50 m Classe C : Classe de précision supérieure à 1,50 m
comment: Gelocation Quality @en
see also: Géostandard Réseaux d’adduction d’eau potable et d’assainissement (RAEPA) v1.2 https://www.geoinformations.developpement-durable.gouv.fr/geostandard-reseaux-d-adduction-d-eau-potable-et-d-a3674.html

GeolocationQualityXY
type: Class
subclass of: Qualité Géolocalisation
comment: Planimetric geolocation quality @en
comment: Qualité de la géolocalisation planimétrique

GeolocationQualityZ
type: Class
subclass of: Qualité Géolocalisation
comment: Altimetric geolocation quality @en
comment: Qualité de la géolocalisation altimétrique

Géométrie
type: Class
subclass of: spatial-location q
subclass of: Restriction
  on property: inherent-in
  some values from: Élément de réseau
subclass of: Restriction
  on property: inherent-in
  some values from: Partie de l'élément de réseau
subclass of: Restriction
  on property: q-location
  some values from: Coordinate

Verre
type: Class
subclass of: Matériau

Gravitaire
type: Class
subclass of: Mode Circulation
comment: L'eau s'écoule par l'effet de la pesanteur dans la canalisation en pente
see also: Géostandard Réseaux d’adduction d’eau potable et d’assainissement (RAEPA) v1.2 https://www.geoinformations.developpement-durable.gouv.fr/geostandard-reseaux-d-adduction-d-eau-potable-et-d-a3674.html

Percement
type: Class
subclass of: Défaillance
comment: Canalisation percée
see also: Géostandard Réseaux d’adduction d’eau potable et d’assainissement (RAEPA) v1.2 https://www.geoinformations.developpement-durable.gouv.fr/geostandard-reseaux-d-adduction-d-eau-potable-et-d-a3674.html

Incident
type: Class
subclass of: achievement
subclass of: Restriction
  on property: participant
  some values from: Élément de réseau
subclass of: Restriction
  on property: participant
  some values from: Partie de l'élément de réseau
subclass of: Restriction
  on property: has time
  some values from: Temporal entity
comment: Phénomènes affectant les canalisation ou les appareillages dont le déclenchement n'est pas soumis à la volonté humaine (fuite, pollution, débordement, panne)

Avaloir
type: Class
subclass of: Ouvrage
label: Drain, Gully @en
see also: Géostandard Réseaux d’adduction d’eau potable et d’assainissement (RAEPA) v1.2 https://www.geoinformations.developpement-durable.gouv.fr/geostandard-reseaux-d-adduction-d-eau-potable-et-d-a3674.html

Inspection
type: Class
subclass of: accomplishment
subclass of: Restriction
  on property: participant
  some values from: Élément de réseau
subclass of: Restriction
  on property: participant
  some values from: Partie de l'élément de réseau
subclass of: Restriction
  on property: has time
  some values from: Temporal entity
comment: Actions d'examination et de contrôle des canalisation et des appareillages

Altitude du radier
type: Class
subclass of: Altitude
subclass of: Restriction
  on property: inherent-in
  some values from: Regard

Longueur
type: Class
subclass of: physical-quality
subclass of: Restriction
  on property: inherent-in
  some values from: Canalisation

Casse longitudinale
type: Class
subclass of: Défaillance
comment: Canalisation fendue sur sa longueur
see also: Géostandard Réseaux d’adduction d’eau potable et d’assainissement (RAEPA) v1.2 https://www.geoinformations.developpement-durable.gouv.fr/geostandard-reseaux-d-adduction-d-eau-potable-et-d-a3674.html

Maintenance
type: Class
subclass of: accomplishment
subclass of: Restriction
  on property: participant
  some values from: Élément de réseau
subclass of: Restriction
  on property: participant
  some values from: Partie de l'élément de réseau
subclass of: Restriction
  on property: participant
  some values from: Class
    union of: Operator
    union of: ProjectOwner
subclass of: Restriction
  on property: has time
  some values from: Temporal entity
comment: Ensemble des opérations permettant de maintenir ou de rétablir un élément du réseau (remplacement, réparation, réhabilitation

Regard
type: Class
subclass of: Ouvrage
subclass of: Restriction
  on property: has-quality
  some values from: Altitude du radier
subclass of: Restriction
  on property: has-quality
  some values from: Altitude mesurée au tampon
see also: Géostandard Réseaux d’adduction d’eau potable et d’assainissement (RAEPA) v1.2 https://www.geoinformations.developpement-durable.gouv.fr/geostandard-reseaux-d-adduction-d-eau-potable-et-d-a3674.html

Tampon de regard
type: Class
subclass of: Partie de l'élément de réseau
subclass of: Restriction
  on property: has-quality
  some values from: Diametre Nominal
subclass of: Restriction
  on property: specific-constant-constituent
  some values from: Matériau
comment: A cover placed on a manhole at ground level providing access to underground @en

Maçonné
type: Class
subclass of: Matériau

Matériau
type: Class
subclass of: amount-of-matter
subclass of: Restriction
  on property: specific-constant-constituent
  some values from: Canalisation
subclass of: Restriction
  on property: specific-constant-constituent
  some values from: Tampon de regard
is defined by: Géostandard Réseaux d’adduction d’eau potable et d’assainissement (RAEPA) v1.2 https://www.geoinformations.developpement-durable.gouv.fr/geostandard-reseaux-d-adduction-d-eau-potable-et-d-a3674.html

Métal
type: Class
subclass of: Matériau
comment: It includes among others: steel, galvanized steel, copper, lead, cast iron , ductile iron @en

Pierre meulière
type: Class
subclass of: Matériau

Casse nette
type: Class
subclass of: Défaillance
comment: Canalisation cassée
see also: Géostandard Réseaux d’adduction d’eau potable et d’assainissement (RAEPA) v1.2 https://www.geoinformations.developpement-durable.gouv.fr/geostandard-reseaux-d-adduction-d-eau-potable-et-d-a3674.html

Type Réseau Assainissement
type: Class
subclass of: physical-object
subclass of: Restriction
  on property: assignedTo
  some values from: AttributeAuthor
subclass of: Restriction
  on property: assignedTo
  some values from: Operator
subclass of: Restriction
  on property: assignedTo
  some values from: ProjectOwner
subclass of: Restriction
  on property: part
  some values from: Élément de réseau
subclass of: Restriction
  on property: part
  some values from: Partie de l'élément de réseau
subclass of: Restriction
  on property: part-of
  some values from: Type Réseau Assainissement
subclass of: Restriction
  on property: participant-in
  some values from: Incident
subclass of: Restriction
  on property: participant-in
  some values from: Inspection
subclass of: Restriction
  on property: participant-in
  some values from: Maintenance
subclass of: Restriction
  on property: participant-in
  some values from: Réparation
comment: Type de réseau d'assainissement collectif
see also: Géostandard Réseaux d’adduction d’eau potable et d’assainissement (RAEPA) v1.2 https://www.geoinformations.developpement-durable.gouv.fr/geostandard-reseaux-d-adduction-d-eau-potable-et-d-a3674.html

Élément de réseau
type: Class
subclass of: physical-object
subclass of: Restriction
  on property: assignedTo
  some values from: AttributeAuthor
subclass of: Restriction
  on property: assignedTo
  some values from: Operator
subclass of: Restriction
  on property: assignedTo
  some values from: ProjectOwner
subclass of: Restriction
  on property: has-quality
  some values from: Géométrie
subclass of: Restriction
  on property: part
  some values from: Partie de l'élément de réseau
subclass of: Restriction
  on property: part-of
  some values from: Type Réseau Assainissement
subclass of: Restriction
  on property: participant-in
  some values from: Geolocalization
subclass of: Restriction
  on property: participant-in
  some values from: Incident
subclass of: Restriction
  on property: participant-in
  some values from: Inspection
subclass of: Restriction
  on property: participant-in
  some values from: Maintenance
subclass of: Restriction
  on property: participant-in
  some values from: Réparation
subclass of: Restriction
  on property: participant-in
  some values from: Etat de service du patrimoine
comment: Abstract base type representing an element in a network. Every element in a network provides some function that is of interest in the network. @en
see also: Infrastructure for Spatial Information in Europe (INSPIRE) @en

Partie de l'élément de réseau
type: Class
subclass of: physical-object
subclass of: Restriction
  on property: assignedTo
  some values from: AttributeAuthor
subclass of: Restriction
  on property: assignedTo
  some values from: Operator
subclass of: Restriction
  on property: assignedTo
  some values from: ProjectOwner
subclass of: Restriction
  on property: has-quality
  some values from: Altitude
subclass of: Restriction
  on property: part-of
  some values from: Type Réseau Assainissement
subclass of: Restriction
  on property: part-of
  some values from: Élément de réseau
subclass of: Restriction
  on property: participant-in
  some values from: Geolocalization
subclass of: Restriction
  on property: participant-in
  some values from: Incident
subclass of: Restriction
  on property: participant-in
  some values from: Inspection
subclass of: Restriction
  on property: participant-in
  some values from: Maintenance
subclass of: Restriction
  on property: participant-in
  some values from: Réparation
subclass of: Restriction
  on property: participant-in
  some values from: Etat de service du patrimoine
label: Parts of Conduits and Nodes @en

Nœud
type: Class
subclass of: Élément de réseau
subclass of: Restriction
  on property: weakConnectionDownstream
  some values from: Canalisation
subclass of: Restriction
  on property: weakConnectionUpstream
  some values from: Canalisation
subclass of: Restriction
  on property: has-quality
  some values from: Altitude
subclass of: Restriction
  on property: weak-connection
  some values from: Canalisation
comment: A node can either represent an apparatus or a structure, where a structure may encompass one or more apparatuses @en
comment: Lieu de jonction de plusieurs tronçons de conduite ou de percement d'un tronçon de conduite
see also: Géostandard Réseaux d’adduction d’eau potable et d’assainissement (RAEPA) v1.2 https://www.geoinformations.developpement-durable.gouv.fr/geostandard-reseaux-d-adduction-d-eau-potable-et-d-a3674.html

Operator
type: Class
subclass of: SocialObject
comment: Gestionnaire exploitant du réseau
see also: Géostandard Réseaux d’adduction d’eau potable et d’assainissement (RAEPA) v1.2 https://www.geoinformations.developpement-durable.gouv.fr/geostandard-reseaux-d-adduction-d-eau-potable-et-d-a3674.html

Tuyau
type: Class
subclass of: Canalisation
comment: A closed conduit that transports flow @en

Défaillance
type: Class
subclass of: feature
subclass of: Restriction
  on property: part-of
  some values from: Élément de réseau
subclass of: Restriction
  on property: participant-in
  some values from: Réparation
comment: Type de la défaillance ayant rendu nécessaire une réparation
see also: Géostandard Réseaux d’adduction d’eau potable et d’assainissement (RAEPA) v1.2 https://www.geoinformations.developpement-durable.gouv.fr/geostandard-reseaux-d-adduction-d-eau-potable-et-d-a3674.html

Plastique
type: Class
subclass of: Matériau
comment: It includes among others: PVC, CPVC, PB, PE, PEX, PP, FRP @en

ProjectOwner
type: Class
subclass of: SocialObject
comment: Maître d'ouvrage du réseau
see also: Géostandard Réseaux d’adduction d’eau potable et d’assainissement (RAEPA) v1.2 https://www.geoinformations.developpement-durable.gouv.fr/geostandard-reseaux-d-adduction-d-eau-potable-et-d-a3674.html

En projet
type: Class
subclass of: Etat de service du patrimoine
comment: The facility is being designed. Construction has not yet started. @en
see also: Infrastructure for Spatial Information in Europe (INSPIRE) @en

Station de pompage
type: Class
subclass of: Ouvrage
subclass of: Restriction
  on property: has-quality
  some values from: Volume
comment: Station de pompage d'eaux usées et/ou pluviales
see also: Géostandard Réseaux d’adduction d’eau potable et d’assainissement (RAEPA) v1.2 https://www.geoinformations.developpement-durable.gouv.fr/geostandard-reseaux-d-adduction-d-eau-potable-et-d-a3674.html

Eau de récupération
type: Class
subclass of: Type d'eaux usées
comment: Reclaimed water, sometimes called recycled water, is former wastewater (sewage) that has been treated to remove solids and certain impurities, and then used in sustainable landscaping irrigation or to recharge groundwater aquifers. @en
see also: Infrastructure for Spatial Information in Europe (INSPIRE) @en

Réparation
type: Class
subclass of: achievement
subclass of: Restriction
  on property: participant
  some values from: Élément de réseau
subclass of: Restriction
  on property: participant
  some values from: Partie de l'élément de réseau
subclass of: Restriction
  on property: participant
  some values from: Défaillance
subclass of: Restriction
  on property: participant
  some values from: Class
    union of: Operator
    union of: ProjectOwner
subclass of: Restriction
  on property: has time
  some values from: Temporal entity
comment: Lieu d'une intervention sur le réseau effectuée suite à une défaillance dudit réseau
see also: Géostandard Réseaux d’adduction d’eau potable et d’assainissement (RAEPA) v1.2 https://www.geoinformations.developpement-durable.gouv.fr/geostandard-reseaux-d-adduction-d-eau-potable-et-d-a3674.html

Bassin de stockage
type: Class
subclass of: Ouvrage
comment: Ouvrage de stockage d'eaux usées et/ou pluviales
label: Detention Basin @en
see also: Géostandard Réseaux d’adduction d’eau potable et d’assainissement (RAEPA) v1.2 https://www.geoinformations.developpement-durable.gouv.fr/geostandard-reseaux-d-adduction-d-eau-potable-et-d-a3674.html

Altitude mesurée au tampon
type: Class
subclass of: Altitude
subclass of: Restriction
  on property: inherent-in
  some values from: Regard

Eaux usées
type: Class
subclass of: Type d'eaux usées
comment: Sanitary sewers remove waste products from peoples' home and send them underground to a treatment plant. @en
see also: Infrastructure for Spatial Information in Europe (INSPIRE) @en

Type d'eaux usées
type: Class
subclass of: amount-of-matter
subclass of: Restriction
  on property: generic-dependent
  some values from: Catégorie Canalisation Assainissement
comment: Classification of sewer water types. @en
see also: Infrastructure for Spatial Information in Europe (INSPIRE) @en

Forme
type: Class
subclass of: physical-quality
subclass of: Restriction
  on property: inherent-in
  some values from: Canalisation

Pente
type: Class
subclass of: physical-quality
subclass of: Restriction
  on property: inherent-in
  some values from: Canalisation

Déversoir d'orage
type: Class
subclass of: Ouvrage
comment: Ouvrage de décharge du trop-plein d'effluents d'une canalisation d'assainissement collectif vers un milieu naturel récepteur
label: Weir, Spillway @en
see also: Géostandard Réseaux d’adduction d’eau potable et d’assainissement (RAEPA) v1.2 https://www.geoinformations.developpement-durable.gouv.fr/geostandard-reseaux-d-adduction-d-eau-potable-et-d-a3674.html

Eaux pluviales
type: Class
subclass of: Catégorie Canalisation Assainissement
comment: Canalisation véhiculant des eaux pluviales
see also: Géostandard Réseaux d’adduction d’eau potable et d’assainissement (RAEPA) v1.2 https://www.geoinformations.developpement-durable.gouv.fr/geostandard-reseaux-d-adduction-d-eau-potable-et-d-a3674.html

Pluvial
type: Class
subclass of: Type Réseau Assainissement
comment: Réseau de collecte de seules eaux pluviales
see also: Géostandard Réseaux d’adduction d’eau potable et d’assainissement (RAEPA) v1.2 https://www.geoinformations.developpement-durable.gouv.fr/geostandard-reseaux-d-adduction-d-eau-potable-et-d-a3674.html

Ruissellement pluvial
type: Class
subclass of: Type d'eaux usées
comment: Storm wastewater drains gather rain and storm runoff and direct them to wetlands and lakes. Ditches and curb line grates are storm drains. @en
see also: Infrastructure for Spatial Information in Europe (INSPIRE) @en

Ouvrage
type: Class
subclass of: Nœud
comment: Nœud (coupant ou non) où est positionné un ouvrage en maçonnerie (regard, chambre, etc.) abritant ou non un ou plusieurs appareillages
comment: Subclasses include the most common structures. @en
see also: Géostandard Réseaux d’adduction d’eau potable et d’assainissement (RAEPA) v1.2 https://www.geoinformations.developpement-durable.gouv.fr/geostandard-reseaux-d-adduction-d-eau-potable-et-d-a3674.html

Transport
type: Class
subclass of: Fonction Canalisation Assainissement
comment: Canalisation de transport
comment: mainly used for transportation of water/electr/etc over long distances to distribution points @en
see also: Géostandard Réseaux d’adduction d’eau potable et d’assainissement (RAEPA) v1.2 https://www.geoinformations.developpement-durable.gouv.fr/geostandard-reseaux-d-adduction-d-eau-potable-et-d-a3674.html
see also: Infrastructure for Spatial Information in Europe (INSPIRE) @en

Station d'épuration
type: Class
subclass of: Ouvrage
subclass of: Restriction
  on property: has-quality
  some values from: Volume
comment: Station de traitement d'eaux usées
see also: Géostandard Réseaux d’adduction d’eau potable et d’assainissement (RAEPA) v1.2 https://www.geoinformations.developpement-durable.gouv.fr/geostandard-reseaux-d-adduction-d-eau-potable-et-d-a3674.html

En construction
type: Class
subclass of: Etat de service du patrimoine
comment: The facility is under construction and not yet functional. This applies only to the initial construction of the facility and not to maintenance work @en
see also: Infrastructure for Spatial Information in Europe (INSPIRE) @en

Extrémité du conduit amont
type: Class
subclass of: Point de conduite
comment: Starting point of a conduit (initial point) @en

Etat de service du patrimoine
type: Class
subclass of: state
subclass of: Restriction
  on property: participant
  some values from: Élément de réseau
subclass of: Restriction
  on property: participant
  some values from: Partie de l'élément de réseau
comment: The status of an object with regards to its completion and use @en
see also: Infrastructure for Spatial Information in Europe (INSPIRE) @en

Sous-vide
type: Class
subclass of: Mode Circulation
comment: L'eau circule par l'effet de la mise sous vide de la canalisation par une centrale d'aspiration
see also: Géostandard Réseaux d’adduction d’eau potable et d’assainissement (RAEPA) v1.2 https://www.geoinformations.developpement-durable.gouv.fr/geostandard-reseaux-d-adduction-d-eau-potable-et-d-a3674.html

Vanne
type: Class
subclass of: Appareillage
comment: Vanne d'assainissement
see also: Géostandard Réseaux d’adduction d’eau potable et d’assainissement (RAEPA) v1.2 https://www.geoinformations.developpement-durable.gouv.fr/geostandard-reseaux-d-adduction-d-eau-potable-et-d-a3674.html

Volume
type: Class
subclass of: physical-quality
subclass of: Restriction
  on property: inherent-in
  some values from: Station de pompage
subclass of: Restriction
  on property: inherent-in
  some values from: Station d'épuration

Eaux usées
type: Class
subclass of: Catégorie Canalisation Assainissement
comment: Canalisation véhiculant des eaux usées
see also: Géostandard Réseaux d’adduction d’eau potable et d’assainissement (RAEPA) v1.2 https://www.geoinformations.developpement-durable.gouv.fr/geostandard-reseaux-d-adduction-d-eau-potable-et-d-a3674.html

Eaux usées
type: Class
subclass of: Type Réseau Assainissement
comment: Réseau de collecte de seules eaux usées
see also: Géostandard Réseaux d’adduction d’eau potable et d’assainissement (RAEPA) v1.2 https://www.geoinformations.developpement-durable.gouv.fr/geostandard-reseaux-d-adduction-d-eau-potable-et-d-a3674.html

XCoordinate
type: Class
subclass of: Coordinate
comment: Coordonnée X Lambert 93 (en mètres)
see also: Géostandard Réseaux d’adduction d’eau potable et d’assainissement (RAEPA) v1.2 https://www.geoinformations.developpement-durable.gouv.fr/geostandard-reseaux-d-adduction-d-eau-potable-et-d-a3674.html

YCoordinate
type: Class
subclass of: Coordinate
comment: Coordonnée Y Lambert 93 (en mètres)
see also: Géostandard Réseaux d’adduction d’eau potable et d’assainissement (RAEPA) v1.2 https://www.geoinformations.developpement-durable.gouv.fr/geostandard-reseaux-d-adduction-d-eau-potable-et-d-a3674.html

Date-time interval
type: Class
subclass of: Proper interval
comment: 'intervalo de fecha-hora' es una subclase de 'intervalo propio', definida utilizando el multi-elemento 'descripción de fecha-hora'. @es
comment: DateTimeInterval is a subclass of ProperInterval, defined using the multi-element DateTimeDescription. @en
label: intervalo de fecha-hora @es
note: 'intervalo de fecha-hora' se puede utilizar sólo para un intervalo cuyos límites coinciden con un elemento de fecha-hora alineados con el calendario y la zona horaria indicados. Por ejemplo, aunque ambos tienen una duración de un día, el intervalo de 24 horas que empieza en la media noche del comienzo del 8 mayo en Europa Central se puede expresar como un 'intervalo de fecha-hora', el intervalo de 24 horas que empieza a las 1:30pm no. @es
note: :DateTimeInterval can only be used for an interval whose limits coincide with a date-time element aligned to the calendar and timezone indicated. For example, while both have a duration of one day, the 24-hour interval beginning at midnight at the beginning of 8 May in Central Europe can be expressed as a :DateTimeInterval, but the 24-hour interval starting at 1:30pm cannot. @en

duración de tiempo
type: Class
subclass of: Temporal duration
comment: Duración de una extensión temporal expresada como un número escalado por una unidad temporal. @es
comment: Duration of a temporal extent expressed as a number scaled by a temporal unit @en
label: Time duration @en
note: Alternativa a 'descripción de tiempo' para proporcionar descripción soporte a una duración temporal diferente a utilizar un sistema de calendario/reloj. @es
note: Alternative to time:DurationDescription to support description of a temporal duration other than using a calendar/clock system. @en

Duration description
type: Class
subclass of: Generalized duration description
comment: Descripción de extensión temporal estructurada con valores separados para los distintos elementos de un sistema de horario-calendario. El sistema de referencia temporal se fija al calendario gregoriano, y el intervalo de cada una de las propiedades numéricas se restringe a xsd:decimal. @es
comment: Description of temporal extent structured with separate values for the various elements of a calendar-clock system. The temporal reference system is fixed to Gregorian Calendar, and the range of each of the numeric properties is restricted to xsd:decimal @en
label: descripción de duración @es
note: En el calendario gregoriano la longitud de los meses no es fija. Por lo tanto, un valor como "2,5 meses" no se puede comparar exactamente con una duración similar expresada en términos de semanas o días. @es
note: In the Gregorian calendar the length of the month is not fixed. Therefore, a value like "2.5 months" cannot be exactly compared with a similar duration expressed in terms of weeks or days. @en

Generalized duration description
type: Class
subclass of: Temporal duration
comment: Descripción de extensión temporal estructurada con valores separados para los distintos elementos de un sistema de horario-calendario. @es
comment: Description of temporal extent structured with separate values for the various elements of a calendar-clock system. @en
label: descripción de duración generalizada @es
note: La extensión de una duración de tiempo expresada como una 'descripción de duración general' depende del Sistema de Referencia Temporal. En algunos calendarios la longitud de la semana o del mes no es constante a lo largo del año. Por tanto, un valor como "25 meses" puede no ser necesariamente ser comparado con un duración similar expresada en términos de semanas o días. Cuando se consideran calendarios que no están basados en el movimiento de la Tierra, se deben tomar incluso más precauciones en la comparación de duraciones. @es
note: The extent of a time duration expressed as a GeneralDurationDescription depends on the Temporal Reference System. In some calendars the length of the week or month is not constant within the year. Therefore, a value like "2.5 months" may not necessarily be exactly compared with a similar duration expressed in terms of weeks or days. When non-earth-based calendars are considered even more care must be taken in comparing durations. @en

Time instant
type: Class
subclass of: Temporal entity
disjoint with: Proper interval
comment: A temporal entity with zero extent or duration @en
comment: Una entidad temporal con una extensión o duración cero. @es
label: instante de tiempo. @es

Time interval
type: Class
subclass of: Temporal entity
comment: A temporal entity with an extent or duration @en
comment: Una entidad temporal con una extensión o duración. @es
label: intervalo de tiempo @es

Proper interval
type: Class
subclass of: Time interval
comment: A temporal entity with non-zero extent or duration, i.e. for which the value of the beginning and end are different @en
comment: Una entidad temporal con extensión o duración distinta de cero, es decir, para la cual los valores de principio y fin del intervalo son diferentes. @es
label: intervalo propio @es

Temporal duration
type: Class
comment: Extensión de tiempo; duración de un intervalo de tiempo independiente de su posición de inicio particular. @es
comment: Time extent; duration of a time interval separate from its particular start position @en
label: duración temporal @es

Temporal entity
type: Class
equivalent class: Class
  union of: Time instant
  union of: Time interval
subclass of: Thing
subclass of: Restriction
  on property: has temporal duration
  some values from: Temporal duration
comment: A temporal interval or instant. @en
comment: Un intervalo temporal o un instante. @es
label: entidad temporal @es

Temporal unit
type: Class
subclass of: Temporal duration
comment: A standard duration, which provides a scale factor for a time extent, or the granularity or precision for a time position. @en
comment: Una duración estándar, que proporciona un factor de escala para una extensión de tiempo, o la granularidad o precisión para una posición de tiempo. @es
label: unidad de tiempo @es
change note: Remove enumeration from definition, in order to allow other units to be used when required in other coordinate systems. NOTE: existing units are still present as members of the class, but the class membership is now open. In the original OWL-Time the following constraint appeared: owl:oneOf ( time:unitSecond time:unitMinute time:unitHour time:unitDay time:unitWeek time:unitMonth time:unitYear ) ; @en
note: La pertenencia de la clase 'unidad de tiempo' está abierta, para permitir otras unidades de tiempo utilizadas en algunas aplicaciones técnicas (por ejemplo, millones de años o el mes Baha'i). @es
note: Membership of the class TemporalUnit is open, to allow for other temporal units used in some technical applications (e.g. millions of years, Baha'i month). @en